{"text_format":"1","workbook":"xlsx","n_sheets":20,"sheets":["Usage","Choix initiaux","Caractéristiques","Compétences","Matériel","Modele-Recto","Valeurs-Recto","Modele-Verso","Valeurs-Verso","Fichiers","Taille","Compétence par défaut","Jeunesse","Espèce","Métiers","Liste-Contacts","Liste-Equipement","Carac. Min","Carac. Moy","Carac. Max"],"not_rendered":{"charts":1,"images":0,"macros":1,"external_links":0,"defined_names":0,"comments":5,"pivot_tables":0},"unopened":[],"bounds":{"document_bytes":16777216,"sheet_cells":100000,"rows_first":2000,"rows_last":500,"rows_between":2000,"halvings":0,"cell_chars":16384,"cell_head_chars":4096},"cells_cut":0,"cells_raw":0,"read":"whole","date_system":"1900"}

{"sheet":"Usage","index":0,"n_rows":16,"n_cols":3,"rows_kept":16,"cut":false,"hidden":false,"merged":[[13,1,15,1]]}
["Etape","Feuille (onglets verts)","Procédure"]
["Choix initiaux","Choix initiaux","S'imaginer le personnage, se le représenter : forces, faiblesses, habitudes, manière d'être, etc...\nChoisir son espèce, son métier, son origine (planète, station, vaisseau nomade, état, faction, etc…) et lui donner un nom\nNoter ces informations dans les cases vertes de la feuille \"Choix initiaux\""]
["Tirage des caractéristiques","Caractéristiques","Tirer 10 fois 2D4 et n'en garder que les 8 tirages les plus hauts\nLes affecter aux caractéristiques selon l'image que l'on se fait de son personnage et les inscrire dans la zone verte de la feuille \"Caractéristiques\"\nLe tableau donne pour chaque espèce les caractéristiques résultant de ce tirage, ainsi que les valeurs qui en sont dérivées"]
["Compétences de jeunesse","Compétences","Affecter des % aux deux compétences marquées en vert dans la colonne \"Jeunesse\"\nLes compétences Culture() et Langue() ayant des spécialités, choisir celles-ci et les marquer dans les cases correspondantes vertes\nLes totaux en bas de colonne passeront en vert lorsque les nombres de compétences et de points affectés seront bons"]
["Compétences d'espèce","Compétences","Affecter des % à des compétences choisies parmi celles marquées en vert dans la colonne portant en titre le nom de l'espèce choisie\nPour les compétences ayant des spécialités, choisir celles-ci et les marquer dans les cases vertes correspondantes\nLes totaux en bas de colonne passeront en vert lorsque les nombres de compétences et de points affectés seront bons"]
["Compétences de métier","Compétences","Affecter des % à des compétences choisies parmi celles marquées en vert dans la colonne portant en titre le nom du métier choisi\nPour les compétences ayant des spécialités, choisir celles-ci et les marquer dans les cases vertes correspondantes\nLes totaux en bas de colonne passeront en vert lorsque les nombres de compétences et de points affectés seront bons"]
{"$rows_left_out":11}
{"sheet":"Choix initiaux","index":1,"n_rows":14,"n_cols":1,"rows_kept":14,"cut":false,"hidden":false,"merged":[]}
["Nom"]
["Ant'AkaR H'alk"]
[]
["Joueur"]
["_ _ _ _ _ _ _ _ _ _ _ _ _ _ _ _ _ _ _ _"]
[]
{"$rows_left_out":9}
{"sheet":"Caractéristiques","index":2,"n_rows":17,"n_cols":12,"rows_kept":17,"cut":false,"hidden":false,"merged":[]}
["Caractéristique","2D4 (2-8)","Changeforme","Humain","K'Rinn","Marionnettiste","Rith","Sshaad",null,"Porteur","Porteur","Porteur"]
["TAIlle",4,{"$f":"ROUNDUP(8+$B2*1.5,0)","v":14},{"$f":"8+$B2*1","v":12},{"$f":"6+$B2*1","v":10},{"$f":"ROUNDUP(1+$B2/2,0)","v":3},{"$f":"17+$B2*1","v":21},{"$f":"9+$B2*1","v":13}]
["APParence",3,{"$f":"($B3+7)*1","v":10},10,10,10,10,10]
["DEXtérité",5,{"$f":"($B4+7)*1","v":12},{"$f":"($B4+7)*1","v":12},{"$f":"($B4+10)*1","v":15},{"$f":"($B4+8)*1","v":13},{"$f":"($B4+4)*1","v":9},{"$f":"($B4+4)*1","v":9}]
["FORce",3,{"$f":"($B5+7)*1","v":10},{"$f":"($B5+10)*1","v":13},{"$f":"($B5+4)*1","v":7},{"$f":"ROUNDUP(($B5+2)/2,0)","v":3},{"$f":"($B5+16)*1","v":19},{"$f":"($B5+10)*1","v":13}]
["CONstitution",2,{"$f":"($B6+7)*1","v":9},{"$f":"($B6+4)*1","v":6},{"$f":"($B6+4)*1","v":6},{"$f":"($B6+4)*1","v":6},{"$f":"($B6+10)*1","v":12},{"$f":"($B6+10)*1","v":12}]
{"$rows_left_out":12}
{"sheet":"Compétences","index":3,"n_rows":43,"n_cols":13,"rows_kept":43,"cut":false,"hidden":false,"merged":[[26,0,33,0],[34,0,40,0],[1,0,12,0],[13,0,15,0],[16,0,19,0],[20,0,25,0]]}
["Domaine","Compétence","Spécialité","Base","Jeunesse",{"$f":"'Choix initiaux'!A8","v":"K'Rinn"},{"$f":"'Choix initiaux'!A11","v":"Détective"},"Libre","Points","Modifiées","Total","Niveau"]
["Interaction",{"$f":"'Compétence par défaut'!B2","v":"Baratin"},null,{"$f":"IF(SUM(CHOOSE(LOOKUP($F$1,Caractéristiques!$C$1:$H$1,{1;2;3;4;5;6}), 'Compétence par défaut'!$E2,'Compétence par défaut'!$F2,'Compétence par défaut'!$G2,'Compétence par défaut'!$H2,'Compétence par défaut'!$I2,'Compétence par défaut'!$J2))=0,'Compétence par défaut'!$D2,CHOOSE(LOOKUP($F$1,Caractéristiques!$C$1:$H$1,{1;2;3;4;5;6}), 'Compétence par défaut'!$E2,'Compétence par défaut'!$F2,'Compétence par défaut'!$G2,'Compétence par défaut'!$H2,'Compétence par défaut'!$I2,'Compétence par défaut'!$J2))","v":5},null,null,null,null,{"$f":"IF(SUM(E2:H2)=0,\"\",SUM(E2:H2))","v":""},{"$f":"IF(SUM(I2)=0,\"\",I2+D2)","v":""},{"$f":"SUM(D2,I2)","v":5},{"$f":"LOOKUP(K2,{0;29;49;79;99},{\"\";0.1;0.2;0.5;1})","v":""},"Historique"]
[null,{"$f":"'Compétence par défaut'!B3","v":"Commandement"},null,{"$f":"IF(SUM(CHOOSE(LOOKUP($F$1,Caractéristiques!$C$1:$H$1,{1;2;3;4;5;6}), 'Compétence par défaut'!$E3,'Compétence par défaut'!$F3,'Compétence par défaut'!$G3,'Compétence par défaut'!$H3,'Compétence par défaut'!$I3,'Compétence par défaut'!$J3))=0,'Compétence par défaut'!$D3,CHOOSE(LOOKUP($F$1,Caractéristiques!$C$1:$H$1,{1;2;3;4;5;6}), 'Compétence par défaut'!$E3,'Compétence par défaut'!$F3,'Compétence par défaut'!$G3,'Compétence par défaut'!$H3,'Compétence par défaut'!$I3,'Compétence par défaut'!$J3))","v":5},null,null,null,null,"","",5,{"$f":"LOOKUP(K3,{0;29;49;79;99},{\"\";0.1;0.2;0.5;1})","v":""},"Eclose sur un monde trop froid, Ant’AkaR a passé son enfance à rêver de terraformation. Après sa "]
[null,{"$f":"'Compétence par défaut'!B4","v":"Culture ()"},"Ka'Ralt",{"$f":"IF(SUM(CHOOSE(LOOKUP($F$1,Caractéristiques!$C$1:$H$1,{1;2;3;4;5;6}), 'Compétence par défaut'!$E4,'Compétence par défaut'!$F4,'Compétence par défaut'!$G4,'Compétence par défaut'!$H4,'Compétence par défaut'!$I4,'Compétence par défaut'!$J4))=0,'Compétence par défaut'!$D4,CHOOSE(LOOKUP($F$1,Caractéristiques!$C$1:$H$1,{1;2;3;4;5;6}), 'Compétence par défaut'!$E4,'Compétence par défaut'!$F4,'Compétence par défaut'!$G4,'Compétence par défaut'!$H4,'Compétence par défaut'!$I4,'Compétence par défaut'!$J4))","v":15},25,null,null,null,25,40,40,{"$f":"LOOKUP(K4,{0;29;49;79;99},{\"\";0.1;0.2;0.5;1})","v":0.1},"métamorphose, trop frêle pour la rude vie de terrain, elle a été employée dans la diplomatie. Lors "]
[null,{"$f":"'Compétence par défaut'!B5","v":"Culture ()"},"Bureaucratie",{"$f":"IF(SUM(CHOOSE(LOOKUP($F$1,Caractéristiques!$C$1:$H$1,{1;2;3;4;5;6}), 'Compétence par défaut'!$E5,'Compétence par défaut'!$F5,'Compétence par défaut'!$G5,'Compétence par défaut'!$H5,'Compétence par défaut'!$I5,'Compétence par défaut'!$J5))=0,'Compétence par défaut'!$D5,CHOOSE(LOOKUP($F$1,Caractéristiques!$C$1:$H$1,{1;2;3;4;5;6}), 'Compétence par défaut'!$E5,'Compétence par défaut'!$F5,'Compétence par défaut'!$G5,'Compétence par défaut'!$H5,'Compétence par défaut'!$I5,'Compétence par défaut'!$J5))","v":5},null,null,40,null,40,45,45,{"$f":"LOOKUP(K5,{0;29;49;79;99},{\"\";0.1;0.2;0.5;1})","v":0.1},"des négociations avec les Rithai, elle a déjoué un complot contre l’envoyé de la Rithai Kemae. "]
[null,{"$f":"'Compétence par défaut'!B6","v":"Enseignement"},null,{"$f":"IF(SUM(CHOOSE(LOOKUP($F$1,Caractéristiques!$C$1:$H$1,{1;2;3;4;5;6}), 'Compétence par défaut'!$E6,'Compétence par défaut'!$F6,'Compétence par défaut'!$G6,'Compétence par défaut'!$H6,'Compétence par défaut'!$I6,'Compétence par défaut'!$J6))=0,'Compétence par défaut'!$D6,CHOOSE(LOOKUP($F$1,Caractéristiques!$C$1:$H$1,{1;2;3;4;5;6}), 'Compétence par défaut'!$E6,'Compétence par défaut'!$F6,'Compétence par défaut'!$G6,'Compétence par défaut'!$H6,'Compétence par défaut'!$I6,'Compétence par défaut'!$J6))","v":20},null,null,null,null,"","",20,{"$f":"LOOKUP(K6,{0;29;49;79;99},{\"\";0.1;0.2;0.5;1})","v":""},"Elle s’est alors passionnée pour les enquêtes et a parcouru les espaces rith et humain. Pour sa "]
{"$rows_left_out":38}
{"sheet":"Matériel","index":4,"n_rows":1,"n_cols":3,"rows_kept":1,"cut":false,"hidden":false,"merged":[]}
["Intitulé","Points","Effets en jeu"]

{"sheet":"Modele-Recto","index":5,"n_rows":42,"n_cols":19,"rows_kept":42,"cut":false,"hidden":false,"merged":[[0,14,0,18],[34,6,40,6],[1,6,12,6],[13,6,15,6],[26,6,33,6],[16,6,19,6],[20,6,25,6]]}
["Nom",null,"Caractéristique","Valeur","%",null,"Domaine","Compétence","Spécialité","Valeur",null,"PV barre invisible","PV barre visible",null,"Armes"]
["_perso_",null,"TAIlle","_tai_","_masse_",null,"Interaction","Baratin",null,"_baratin%_",null,"_pv.00.inv_","_pv.00.vis_",null,"_armes.1.nom_","_armes.1.cmp_","_armes.1.cps_","_armes.1.deg_","_armes.1.mun_"]
[null,null,"APParence","_app_","_app%_",null,null,"Commandement",null,"_command%_",null,"_pv.05.inv_","_pv.05.vis_",null,"_armes.2.nom_","_armes.2.cmp_","_armes.2.cps_","_armes.2.deg_","_armes.2.mun_"]
["Joueur",null,"DEXtérité","_dex_","_dex%_",null,null,"Culture ()","_cult.1_","_cult.1%_",null,"_pv.10.inv_","_pv.10.vis_",null,"_armes.3.nom_","_armes.3.cmp_","_armes.3.cps_","_armes.3.deg_","_armes.3.mun_"]
["_joueur_",null,"FORce","_for_","_for%_",null,null,"Culture ()","_cult.2_","_cult.2%_",null,"_pv.15.inv_","_pv.15.vis_",null,"_armes.4.nom_","_armes.4.cmp_","_armes.4.cps_","_armes.4.deg_","_armes.4.mun_"]
[null,null,"CONstitution","_con_","_con%_",null,null,"Enseignement",null,"_enseign%_",null,"_pv.20.inv_","_pv.20.vis_",null,"_armes.5.nom_","_armes.5.cmp_","_armes.5.cps_","_armes.5.deg_","_armes.5.mun_"]
{"$rows_left_out":37}
{"sheet":"Valeurs-Recto","index":6,"n_rows":42,"n_cols":19,"rows_kept":42,"cut":false,"hidden":false,"merged":[[0,14,0,18],[34,6,40,6],[1,6,12,6],[13,6,15,6],[16,6,19,6],[20,6,25,6],[26,6,33,6]]}
["Nom",null,"Caractéristique","Valeur","%",null,"Domaine","Compétence","Spécialité","Valeur",null,"PV barre invisible","PV barre visible",null,"Armes"]
[{"$f":"'Choix initiaux'!A2","v":"Ant'AkaR H'alk"},null,"TAIlle",{"$f":"CHOOSE(LOOKUP($A$8,Caractéristiques!$C$1:$H$1,{1;2;3;4;5;6}),Caractéristiques!$C2,Caractéristiques!$D2,Caractéristiques!$E2,Caractéristiques!$F2,Caractéristiques!$G2,Caractéristiques!$H2)","v":10},{"$f":"FLOOR(CHOOSE(LOOKUP($A$8,Caractéristiques!$C$1:$H$1,{1;2;3;4;5;6}),Caractéristiques!$C$16,Caractéristiques!$D$16,Caractéristiques!$E$16,Caractéristiques!$F$16,Caractéristiques!$G$16,Caractéristiques!$H$16),1)","v":50},null,"Interaction","Baratin",{"$f":"IF(Compétences!$C2=\"\",\"\",Compétences!$C2)","v":""},{"$f":"Compétences!K2","v":5},null,{"$f":"REPT(\"X\",IF($D$11< 1, 0, IF($D$11> 4, 5, MOD($D$11,5))))","v":"XXXXX"},{"$f":"REPT(\"X\",5-IF($D$11< 1, 0, IF($D$11> 4, 5, MOD($D$11,5))))","v":""},null,"Bâton","C",1,"1D8"]
[null,null,"APParence",{"$f":"CHOOSE(LOOKUP($A$8,Caractéristiques!$C$1:$H$1,{1;2;3;4;5;6}),Caractéristiques!$C3,Caractéristiques!$D3,Caractéristiques!$E3,Caractéristiques!$F3,Caractéristiques!$G3,Caractéristiques!$H3)","v":10},{"$f":"D3*5","v":50},null,null,"Commandement",{"$f":"IF(Compétences!$C3=\"\",\"\",Compétences!$C3)","v":""},{"$f":"Compétences!K3","v":5},null,{"$f":"REPT(\"X\",IF($D$11< 6, 0, IF($D$11> 9, 5, MOD($D$11,5))))","v":"XXX"},{"$f":"REPT(\"X\",5-IF($D$11< 6, 0, IF($D$11> 9, 5, MOD($D$11,5))))","v":"XX"},null,"Taser (étourd.)","D",2,"1D4+2",30]
["Joueur",null,"DEXtérité",{"$f":"CHOOSE(LOOKUP($A$8,Caractéristiques!$C$1:$H$1,{1;2;3;4;5;6}),Caractéristiques!$C4,Caractéristiques!$D4,Caractéristiques!$E4,Caractéristiques!$F4,Caractéristiques!$G4,Caractéristiques!$H4)","v":15},75,null,null,"Culture ()",{"$f":"IF(Compétences!$C4=\"\",\"\",Compétences!$C4)","v":"Ka'Ralt"},{"$f":"Compétences!K4","v":40},null,{"$f":"REPT(\"X\",IF($D$11<11, 0, IF($D$11>14, 5, MOD($D$11,5))))","v":""},{"$f":"REPT(\"X\",5-IF($D$11<11, 0, IF($D$11>14, 5, MOD($D$11,5))))","v":"XXXXX"}]
[{"$f":"'Choix initiaux'!A5","v":"_ _ _ _ _ _ _ _ _ _ _ _ _ _ _ _ _ _ _ _"},null,"FORce",{"$f":"CHOOSE(LOOKUP($A$8,Caractéristiques!$C$1:$H$1,{1;2;3;4;5;6}),Caractéristiques!$C5,Caractéristiques!$D5,Caractéristiques!$E5,Caractéristiques!$F5,Caractéristiques!$G5,Caractéristiques!$H5)","v":7},35,null,null,"Culture ()",{"$f":"IF(Compétences!$C5=\"\",\"\",Compétences!$C5)","v":"Bureaucratie"},{"$f":"Compétences!K5","v":45},null,{"$f":"REPT(\"X\",IF($D$11<16, 0, IF($D$11>19, 5, MOD($D$11,5))))","v":""},{"$f":"REPT(\"X\",5-IF($D$11<16, 0, IF($D$11>19, 5, MOD($D$11,5))))","v":"XXXXX"}]
[null,null,"CONstitution",{"$f":"CHOOSE(LOOKUP($A$8,Caractéristiques!$C$1:$H$1,{1;2;3;4;5;6}),Caractéristiques!$C6,Caractéristiques!$D6,Caractéristiques!$E6,Caractéristiques!$F6,Caractéristiques!$G6,Caractéristiques!$H6)","v":6},30,null,null,"Enseignement",{"$f":"IF(Compétences!$C6=\"\",\"\",Compétences!$C6)","v":""},{"$f":"Compétences!K6","v":20},null,{"$f":"REPT(\"X\",IF($D$11<21, 0, IF($D$11>24, 5, MOD($D$11,5))))","v":""},{"$f":"REPT(\"X\",5-IF($D$11<21, 0, IF($D$11>24, 5, MOD($D$11,5))))","v":"XXXXX"}]
{"$rows_left_out":37}
{"sheet":"Modele-Verso","index":7,"n_rows":23,"n_cols":8,"rows_kept":23,"cut":false,"hidden":false,"merged":[[0,4,0,7],[11,4,11,7]]}
["Nom",null,"Historique",null,"Implants"]
["_perso_",null,"_histoire.1_",null,"Nom","Nb","Description","Prix"]
[null,null,"_histoire.2_",null,"_implants.1.nom_","_implants.1.nb_","_implants.1.desc_","_implants.1.prix_"]
["Joueur",null,"_histoire.3_",null,"_implants.2.nom_","_implants.2.nb_","_implants.2.desc_","_implants.2.prix_"]
["_joueur_",null,"_histoire.4_",null,"_implants.3.nom_","_implants.3.nb_","_implants.3.desc_","_implants.3.prix_"]
[null,null,"_histoire.5_",null,"_implants.4.nom_","_implants.4.nb_","_implants.4.desc_","_implants.4.prix_"]
{"$rows_left_out":18}
{"sheet":"Valeurs-Verso","index":8,"n_rows":21,"n_cols":8,"rows_kept":21,"cut":false,"hidden":false,"merged":[[0,4,0,7],[11,4,11,7]]}
["Nom",null,"Historique",null,"Implants"]
[{"$f":"'Choix initiaux'!A2","v":"Ant'AkaR H'alk"},null,{"$f":"IF(Compétences!M3=\"\",\"\",Compétences!M3)","v":"Eclose sur un monde trop froid, Ant’AkaR a passé son enfance à rêver de terraformation. Après sa "},null,"Nom","Nb","Description","Prix"]
[null,null,{"$f":"IF(Compétences!M4=\"\",\"\",Compétences!M4)","v":"métamorphose, trop frêle pour la rude vie de terrain, elle a été employée dans la diplomatie. Lors "},null,"Téléphone crânien",1,"Connexion discrète a l'infosphère publique","0000"]
["Joueur",null,{"$f":"IF(Compétences!M5=\"\",\"\",Compétences!M5)","v":"des négociations avec les Rithai, elle a déjoué un complot contre l’envoyé de la Rithai Kemae. "},null,"Port mémoire",1,"Port pour aiguille de données","0000"]
[{"$f":"'Choix initiaux'!A5","v":"_ _ _ _ _ _ _ _ _ _ _ _ _ _ _ _ _ _ _ _"},null,{"$f":"IF(Compétences!M6=\"\",\"\",Compétences!M6)","v":"Elle s’est alors passionnée pour les enquêtes et a parcouru les espaces rith et humain. Pour sa "},null,"Port mémoire",1,"Port mémoriel pour compétences","0000"]
[null,null,{"$f":"IF(Compétences!M7=\"\",\"\",Compétences!M7)","v":"sécurité, elle y a appris le combat, malgré sa répugnance. Son passé de diplomate, son intelligence "},null,"Doigt modulable",2,"Emplacement pour modules divers","0000"]
{"$rows_left_out":16}
{"sheet":"Fichiers","index":9,"n_rows":6,"n_cols":2,"rows_kept":6,"cut":false,"hidden":false,"merged":[[0,0,2,0],[3,0,5,0]]}
["Recto","Feuille Modèle (SVG)"]
[null,"Feuille finale (SVG)"]
[null,"Correspondance à exporter (TXT)"]
["Verso","Feuille Modèle (SVG)"]
[null,"Feuille finale (SVG)"]
[null,"Correspondance à exporter (TXT)"]
{"$rows_left_out":1}
{"sheet":"Taille","index":10,"n_rows":33,"n_cols":10,"rows_kept":33,"cut":false,"hidden":false,"merged":[]}
["TAIlle","Chang.","Humains","K'Rinn","Marionn.","Rith","Sshaad","Masse (kg)","Paramètre","Valeur"]
[1,null,null,null,null,null,null,{"$f":"J$3*(A2^J$2)","v":0.5},"Exposant",2]
[2,null,null,null,null,null,null,{"$f":"J$3*(A3^J$2)","v":2},"Multiplicateur",0.5]
[3,null,null,null,null,null,null,4.5]
[4,null,null,null,null,null,null,8]
[5,null,null,null,null,null,null,12.5]
{"$rows_left_out":28}
{"sheet":"Compétence par défaut","index":11,"n_rows":45,"n_cols":10,"rows_kept":45,"cut":false,"hidden":false,"merged":[[1,0,12,0],[34,0,40,0],[13,0,15,0],[26,0,33,0],[16,0,19,0],[20,0,25,0]]}
["Domaine","Compétence","Spécialité","Base","Changeforme","Humain","K'Rinn","Marionnettiste","Rith","Sshaad"]
["Interaction","Baratin",null,5]
[null,"Commandement",null,5,null,null,null,null,20]
[null,"Culture ()","1ère",15]
[null,"Culture ()","2ème",5]
[null,"Enseignement",null,10,null,20,20,null,null,30]
{"$rows_left_out":40}
{"sheet":"Jeunesse","index":12,"n_rows":42,"n_cols":8,"rows_kept":42,"cut":false,"hidden":false,"merged":[[27,0,34,0],[35,0,41,0],[2,0,13,0],[14,0,16,0],[17,0,20,0],[21,0,26,0]]}
["Domaine","Compétence","Changeforme","Humain","K'Rinn","Marionnettiste","Rith","Sshaad"]
["Affectés",null,{"$f":"COUNTIF(C3:C37,\"=\"&\"*\")","v":2},2,2,2,2,2]
["Interaction","Baratin"]
[null,"Commandement"]
[null,"Culture ()","Société de naissance","Société de naissance","Société de naissance","Société de naissance","Société de naissance","Société de renaissance"]
[null,"Culture ()"]
{"$rows_left_out":37}
{"sheet":"Espèce","index":13,"n_rows":42,"n_cols":8,"rows_kept":42,"cut":false,"hidden":false,"merged":[[27,0,34,0],[35,0,41,0],[2,0,13,0],[14,0,16,0],[17,0,20,0],[21,0,26,0]]}
["Domaine","Compétence","Changeforme","Humain","K'Rinn","Marionnettiste","Rith","Sshaad"]
["Affectés",null,{"$f":"COUNTIF(C3:C42,\"=\"&\"*\")","v":8},8,8,8,8,8]
["Interaction","Baratin",null,"x"]
[null,"Commandement",null,null,null,null,"x"]
[null,"Culture ()"]
[null,"Culture ()",null,null,null,null,null,"x"]
{"$rows_left_out":37}
{"sheet":"Métiers","index":14,"n_rows":42,"n_cols":20,"rows_kept":42,"cut":false,"hidden":false,"merged":[[35,0,41,0],[2,0,13,0],[14,0,16,0],[17,0,20,0],[21,0,26,0],[27,0,34,0]]}
["Domaine","Compétence","Businessbeing","Marchand","Contrebandier","Arnaqueur","Policier","Détective","Journaliste","Voleur","Hacker","Soldat","Mercenaire","Officier","Reporter","Mécanicien","Pilote","Astrogateur","Chasseur d'épaves","Médecin"]
["Affectés",null,{"$f":"COUNTIF(C3:C42,\"=\"&\"*\")","v":10},10,10,10,10,10,10,10,10,10,{"$f":"COUNTIF(M3:M42,\"=\"&\"*\")","v":10},10,10,10,10,10,10,10]
["Interaction","Baratin","x","x",null,"x","x","x","x","x",null,null,null,null,"x",null,null,null,"x"]
[null,"Commandement",null,null,null,null,null,null,null,null,null,null,null,"x",null,null,"x",null,null,"x"]
[null,"Culture ()"]
[null,"Culture ()","Une au choix parmi\n(Bureaucratie,\nAffaires)","Une au choix parmi\n(Rue, Bureaucratie,\nSpatiens)","Une au choix parmi\n(Rue, Spatiens)","Une au choix parmi\n(Affaires, Bureaucratie)","Une au choix parmi\n(Affaires, Rue, Droit,\nBureaucratie)","Une au choix parmi\n(Affaires, Spatiens,\nBureaucratie, Rue)","Une au choix parmi\n(Affaires, Rue)","Rue","Hacking","Armée","Armée","Armée","Armée","Une au choix parmi\n(Rue, Bureaucratie,\nSpatiens)","Une au choix parmi\n(Rue, Armée,\nSpatiens)","Spatiens","Spatiens","Soignants"]
{"$rows_left_out":37}
{"sheet":"Liste-Contacts","index":15,"n_rows":4,"n_cols":7,"rows_kept":4,"cut":false,"hidden":false,"merged":[[0,3,0,6]]}
["Nom","Points","Effets en jeu","Contact"]
[null,null,null,"Espèce","Métier","Lieu","Détails"]
["Rilathn d’rih Arlinal",50,"Prix réduits sur les pièces et les vaisseaux\nInformations sur les Adrims Libres, les contrebandiers\net les pirates\nMotivations : Adrims Libres, combattre les Gham Garri, indépendance des Hoshi no Hekka, loyauté aux Capitaines des Forteresses","Rith","Marchand","Eden High","Adrim exfiltré"]
["Chang-Li Liang",50,"Pourra être contacté dans le système Nouvelle Hong-Kong\nInformations sur le Conseil K'Rinn, l'Alliance Planètariste, les contrebandiers et pirates locaux\nMotivations : argent et justice, mais refusera d'agir contre le clan Pei","Humaine","Détective","Nouvelle Hong-Kong","Affiliée au clan Pei"]

{"sheet":"Liste-Equipement","index":16,"n_rows":12,"n_cols":12,"rows_kept":12,"cut":false,"hidden":false,"merged":[[0,7,0,11]]}
["Nom","Points","Description (1 ligne)","Effets en jeu","Prix","Implant ?","Arme ?","Arme"]
[null,null,null,null,null,null,null,"Comp.","Cp/Rnd","Dégâts","Munitions","PA"]
["Téléphone crânien",2,"Connexion discrète à l'infosphère publique","10% de risque de se faire détecter si quelqu'un écoute\nRisque monte à 30% si tentative de l'utiliser pour hacker",null,"x"]
["Port mémoire",5,"Port pour aiguilles de données","Permet de connecter des aiguilles de données",null,"x"]
["Doigt modulaire",15,"Phalange retirée, remplaçable par un module","Livrée avec module neutre imitant un vrai doigt",null,"x"]
["Scanner portatif",10,"Sonde un objet, +30% Evaluer/Remarquer","Compter 1 mn complète par jet"]
{"$rows_left_out":7}
{"sheet":"Carac. Min","index":17,"n_rows":16,"n_cols":8,"rows_kept":16,"cut":false,"hidden":false,"merged":[]}
["Caractéristique","2D4 (2-8)","Changeforme","Humain","K'Rinn","Marionnettiste","Rith","Sshaad"]
["TAIlle",2,{"$f":"ROUNDUP(8+$B2*1.5,0)","v":11},{"$f":"8+$B2*1","v":10},{"$f":"6+$B2*1","v":8},{"$f":"ROUNDUP(1+$B2/2,0)","v":2},{"$f":"17+$B2*1","v":19},{"$f":"9+$B2*1","v":11}]
["APParence",2,{"$f":"($B3+7)*1","v":9},9,9,9,9,9]
["DEXtérité",2,{"$f":"($B4+7)*1","v":9},{"$f":"($B4+7)*1","v":9},{"$f":"($B4+10)*1","v":12},{"$f":"($B4+8)*1","v":10},{"$f":"($B4+4)*1","v":6},{"$f":"($B4+4)*1","v":6}]
["FORce",2,{"$f":"($B5+7)*1","v":9},{"$f":"($B5+10)*1","v":12},{"$f":"($B5+4)*1","v":6},{"$f":"ROUNDUP(($B5+2)/2,0)","v":2},{"$f":"($B5+16)*1","v":18},{"$f":"($B5+10)*1","v":12}]
["CONstitution",2,{"$f":"($B6+7)*1","v":9},{"$f":"($B6+4)*1","v":6},{"$f":"($B6+4)*1","v":6},{"$f":"($B6+4)*1","v":6},{"$f":"($B6+10)*1","v":12},{"$f":"($B6+10)*1","v":12}]
{"$rows_left_out":11}
{"sheet":"Carac. Moy","index":18,"n_rows":16,"n_cols":8,"rows_kept":16,"cut":false,"hidden":false,"merged":[]}
["Caractéristique","2D4 (2-8)","Changeforme","Humain","K'Rinn","Marionnettiste","Rith","Sshaad"]
["TAIlle",{"$f":"(8+2)/2","v":5},{"$f":"ROUNDUP(8+$B2*1.5,0)","v":16},{"$f":"8+$B2*1","v":13},{"$f":"6+$B2*1","v":11},{"$f":"ROUNDUP(1+$B2/2,0)","v":4},{"$f":"17+$B2*1","v":22},{"$f":"9+$B2*1","v":14}]
["APParence",{"$f":"(8+2)/2","v":5},{"$f":"($B3+7)*1","v":12},12,12,12,12,12]
["DEXtérité",5,{"$f":"($B4+7)*1","v":12},{"$f":"($B4+7)*1","v":12},{"$f":"($B4+10)*1","v":15},{"$f":"($B4+8)*1","v":13},{"$f":"($B4+4)*1","v":9},{"$f":"($B4+4)*1","v":9}]
["FORce",5,{"$f":"($B5+7)*1","v":12},{"$f":"($B5+10)*1","v":15},{"$f":"($B5+4)*1","v":9},{"$f":"ROUNDUP(($B5+2)/2,0)","v":4},{"$f":"($B5+16)*1","v":21},{"$f":"($B5+10)*1","v":15}]
["CONstitution",5,{"$f":"($B6+7)*1","v":12},{"$f":"($B6+4)*1","v":9},{"$f":"($B6+4)*1","v":9},{"$f":"($B6+4)*1","v":9},{"$f":"($B6+10)*1","v":15},{"$f":"($B6+10)*1","v":15}]
{"$rows_left_out":11}
{"sheet":"Carac. Max","index":19,"n_rows":16,"n_cols":8,"rows_kept":16,"cut":false,"hidden":false,"merged":[]}
["Caractéristique","2D4 (2-8)","Changeforme","Humain","K'Rinn","Marionnettiste","Rith","Sshaad"]
["TAIlle",8,{"$f":"ROUNDUP(8+$B2*1.5,0)","v":20},{"$f":"8+$B2*1","v":16},{"$f":"6+$B2*1","v":14},{"$f":"ROUNDUP(1+$B2/2,0)","v":5},{"$f":"17+$B2*1","v":25},{"$f":"9+$B2*1","v":17}]
["APParence",8,{"$f":"($B3+7)*1","v":15},15,15,15,15,15]
["DEXtérité",8,{"$f":"($B4+7)*1","v":15},{"$f":"($B4+7)*1","v":15},{"$f":"($B4+10)*1","v":18},{"$f":"($B4+8)*1","v":16},{"$f":"($B4+4)*1","v":12},{"$f":"($B4+4)*1","v":12}]
["FORce",8,{"$f":"($B5+7)*1","v":15},{"$f":"($B5+10)*1","v":18},{"$f":"($B5+4)*1","v":12},{"$f":"ROUNDUP(($B5+2)/2,0)","v":5},{"$f":"($B5+16)*1","v":24},{"$f":"($B5+10)*1","v":18}]
["CONstitution",8,{"$f":"($B6+7)*1","v":15},{"$f":"($B6+4)*1","v":12},{"$f":"($B6+4)*1","v":12},{"$f":"($B6+4)*1","v":12},{"$f":"($B6+10)*1","v":18},{"$f":"($B6+10)*1","v":18}]
{"$rows_left_out":10}